submission_id,submission_date,gender,age,geography,financial_situation,education,employment_status,submission_state,visited_center_last_3months,type_of_visited_center,other_type_of_visited_center,reason_of_visit,other_reason_of_visit,did_receive_medical_attention_during_visit,reason_for_no_attention_during_visit,other_reason_for_no_attention_during_visit,who_attended_visit,other_who_attended_visit,was_asked_to_take_medication,received_prescription,medication_source,other_medication_source,reason_for_not_getting_medication,supply_stores_visited,avg_days_invested_on_medication_search,mode_of_transport_for_medication,other_mode_of_transport_for_medication,someone_has_chronic_health_conditions_requiring_medicine,type_of_chronic_health_conditions_requiring_medicine,other_type_of_chronic_health_conditions_requiring_medicine,takes_medicine_for_chronic_health_conditions,monthly_hypertension_medicine_units_needed,has_limit_to_medications_amount,medications_supply_length,reason_for_3months_medications_supply,other_reason_for_3months_medications_supply,regular_access_to_medications,reason_for_not_taking_medication,currency_for_buying_medications,other_currency_for_buying_medications,avg_monthly_spent_on_medications_or_attention,noticed_increse_in_medications_price,amount_increse_in_medications_price
5871701261025280,2020-06-22,Male,35-44,Suburban/Peri-urban,"I can afford food, but nothing else",Prefer not to answer,Employed full-time,Táchira,0,,,,,,,,,,,,,,,,,,,1.0,Diabetes,did not exist,0.0,,,,,,,I don't consider it necessary,,,,,
5960303333605376,2021-06-23,Female,18-24,Rural,"I can afford food, regular expenses, and clothes, but nothing else",University or college degree completed,"I work full-time, either as an employee or self-employed",Lara,0,,,,,,,,,,,,,,,,,,,0.0,,,,,,,,,,,,,,,
4868836892606464,2021-05-23,Female,18-24,Rural,"I can afford food, regular expenses, and clothes, but nothing else",University or college degree completed,"I work full-time, either as an employee or self-employed",Lara,0,,,,,,,,,,,,,,,,,,,0.0,,,,,,,,,,,,,,,
6145933650427904,2021-08-23,Female,18-24,Rural,"I can afford food, regular expenses, and clothes, but nothing else",University or college degree completed,"I work full-time, either as an employee or self-employed",Lara,0,,,,,,,,,,,,,,,,,,,0.0,,,,,,,,,,,,,,,
4997593162842112,2021-01-23,Female,18-24,Rural,"I can afford food, regular expenses, and clothes, but nothing else",University or college degree completed,"I work full-time, either as an employee or self-employed",Lara,0,,,,,,,,,,,,,,,,,,,0.0,,,,,,,,,,,,,,,
5827397598576640,2020-12-24,Female,18-24,Rural,"I can afford food, regular expenses, and clothes, but nothing else",University or college degree completed,"I work full-time, either as an employee or self-employed",Lara,0,,,,,,,,,,,,,,,,,,,0.0,,,,,,,,,,,,,,,
6566483940605952,2021-03-23,Female,18-24,Rural,"I can afford food, regular expenses, and clothes, but nothing else",University or college degree completed,"I work full-time, either as an employee or self-employed",Lara,0,,,,,,,,,,,,,,,,,,,0.0,,,,,,,,,,,,,,,
5631070157668352,2021-04-23,Female,18-24,Rural,"I can afford food, regular expenses, and clothes, but nothing else",University or college degree completed,"I work full-time, either as an employee or self-employed",Lara,0,,,,,,,,,,,,,,,,,,,0.0,,,,,,,,,,,,,,,
5074281802498048,2020-10-25,Female,18-24,Rural,"I can afford food, regular expenses, and clothes, but nothing else",University or college degree completed,"I work full-time, either as an employee or self-employed",Lara,0,,,,,,,,,,,,,,,,,,,0.0,,,,,,,,,,,,,,,
6209628806578176,2021-02-23,Female,18-24,Rural,"I can afford food, regular expenses, and clothes, but nothing else",University or college degree completed,"I work full-time, either as an employee or self-employed",Lara,0,,,,,,,,,,,,,,,,,,,0.0,,,,,,,,,,,,,,,
5470624144424960,2020-11-23,Female,18-24,Rural,"I can afford food, regular expenses, and clothes, but nothing else",University or college degree completed,"I work full-time, either as an employee or self-employed",Lara,0,,,,,,,,,,,,,,,,,,,0.0,,,,,,,,,,,,,,,
5901841497063424,2021-07-23,Female,18-24,Rural,"I can afford food, regular expenses, and clothes, but nothing else",University or college degree completed,"I work full-time, either as an employee or self-employed",Lara,0,,,,,,,,,,,,,,,,,,,0.0,,,,,,,,,,,,,,,
6548076392349696,2020-11-30,Female,35-44,Suburban/Peri-urban,"I can comfortably afford food, clothes, and furniture, and I have savings",College or university,Employed part-time,Anzoátegui,0,,,,,,,,,,,,,,,,,,,0.0,,,,,,,,,,,,,,,
6057210334674944,2020-11-10,Female,35-44,Suburban/Peri-urban,"I can comfortably afford food, clothes, and furniture, and I have savings",College or university,Employed part-time,Anzoátegui,0,,,,,,,,,,,,,,,,,,,0.0,,,,,,,,,,,,,,,
4527231549571072,2020-10-16,Female,18-24,Suburban/Peri-urban,I cannot afford enough food for my family,Secondary school/ high school completed,I am a student,Táchira,0,,,,,,,,,,,,,,,,,,,0.0,,,,,,,,,,,,,,,
4603922948030464,2020-06-18,Female,55 or more,City center or metropolitan area,I cannot afford enough food for my family,Technical school,Retired,Distrito Federal,0,,,,,,,,,,,,,,,,,,,0.0,,did not exist,,,,,,,,,,,,,
6329404446998528,2021-04-16,Female,35-44,City center or metropolitan area,"I can afford food and regular expenses, but nothing else",University or college degree completed,I am unemployed,Distrito Federal,0,,,,,,,,,,,,,,,,,,,0.0,,,,,,,,,,,,,,,
6325289337225216,2021-08-16,Female,35-44,City center or metropolitan area,I cannot afford enough food for my family,University or college degree completed,"I work full-time, either as an employee or self-employed",Distrito Federal,0,,,,,,,,,,,,,,,,,,,0.0,,,,,,,,,,,,,,,
5508273060184064,2020-08-16,Female,35-44,Suburban/Peri-urban,"I can afford food and regular expenses, but nothing else",University or college degree completed,"I work part-time, either as an employee or self-employed",Miranda,0,,,,,,,,,,,,,,,,,,,0.0,,did not exist,,,,,,,,,,,,,
5020901667241984,2020-10-16,Female,35-44,Suburban/Peri-urban,"I can afford food and regular expenses, but nothing else",University or college degree completed,"I work part-time, either as an employee or self-employed",Miranda,0,,,,,,,,,,,,,,,,,,,0.0,,,,,,,,,,,,,,,
5658428566667264,2021-02-16,Male,35-44,Suburban/Peri-urban,"I can afford food and regular expenses, but nothing else",University or college degree completed,"I work part-time, either as an employee or self-employed",Miranda,0,,,,,,,,,,,,,,,,,,,0.0,,,,,,,,,,,,,,,
4563357658251264,2021-01-16,Male,25-34,Suburban/Peri-urban,"I can afford food and regular expenses, but nothing else",University or college degree completed,"I work part-time, either as an employee or self-employed",Miranda,0,,,,,,,,,,,,,,,,,,,1.0,Heart disease (Hypertension),,0.0,,,,,,,I don't have the money to buy it,,,,,
6484192807616512,2021-06-16,Female,35-44,Suburban/Peri-urban,"I can afford food and regular expenses, but nothing else",University or college degree completed,"I work part-time, either as an employee or self-employed",Miranda,0,,,,,,,,,,,,,,,,,,,0.0,,,,,,,,,,,,,,,
5194877590831104,2021-05-16,Male,25-34,Suburban/Peri-urban,"I can afford food and regular expenses, but nothing else",University or college degree completed,"I work part-time, either as an employee or self-employed",Miranda,0,,,,,,,,,,,,,,,,,,,0.0,,,,,,,,,,,,,,,
6165942982934528,2021-02-16,Male,35-44,Suburban/Peri-urban,"I can afford food and regular expenses, but nothing else",University or college degree completed,"I work part-time, either as an employee or self-employed",Miranda,0,,,,,,,,,,,,,,,,,,,0.0,,,,,,,,,,,,,,,
4966782770348032,2021-03-16,Male,18-24,Suburban/Peri-urban,"I can afford food and regular expenses, but nothing else",University or college degree completed,"I work part-time, either as an employee or self-employed",Miranda,0,,,,,,,,,,,,,,,,,,,0.0,,,,,,,,,,,,,,,
4734314890919936,2020-11-16,Male,35-44,Suburban/Peri-urban,"I can afford food and regular expenses, but nothing else",University or college degree completed,"I work part-time, either as an employee or self-employed",Miranda,0,,,,,,,,,,,,,,,,,,,0.0,,,,,,,,,,,,,,,
4579634051284992,2020-12-16,Male,18-24,Suburban/Peri-urban,"I can afford food and regular expenses, but nothing else",University or college degree completed,"I work part-time, either as an employee or self-employed",Miranda,0,,,,,,,,,,,,,,,,,,,0.0,,,,,,,,,,,,,,,
6558883646799872,2020-06-16,Female,35-44,Suburban/Peri-urban,"I can afford food and regular expenses, but nothing else",University or college degree completed,"I work part-time, either as an employee or self-employed",Miranda,0,,,,,,,,,,,,,,,,,,,0.0,,did not exist,,,,,,,,,,,,,
5868693545025536,2021-09-16,Male,18-24,Suburban/Peri-urban,"I can afford food and regular expenses, but nothing else",University or college degree completed,"I work part-time, either as an employee or self-employed",Miranda,0,,,,,,,,,,,,,,,,,,,0.0,,,,,,,,,,,,,,,
6038479875342336,2021-08-16,Male,25-34,Suburban/Peri-urban,"I can afford food and regular expenses, but nothing else",University or college degree completed,"I work part-time, either as an employee or self-employed",Miranda,0,,,,,,,,,,,,,,,,,,,0.0,,,,,,,,,,,,,,,
5648140190613504,2021-04-16,Male,25-34,Suburban/Peri-urban,"I can afford food and regular expenses, but nothing else",University or college degree completed,"I work part-time, either as an employee or self-employed",Miranda,0,,,,,,,,,,,,,,,,,,,0.0,,,,,,,,,,,,,,,
6376137268920320,2021-06-16,Female,25-34,Suburban/Peri-urban,"I can afford food and regular expenses, but nothing else",University or college degree completed,"I work part-time, either as an employee or self-employed",Miranda,0,,,,,,,,,,,,,,,,,,,0.0,,,,,,,,,,,,,,,
4592403479789568,2020-07-16,Female,35-44,Suburban/Peri-urban,"I can afford food and regular expenses, but nothing else",University or college degree completed,"I work part-time, either as an employee or self-employed",Miranda,0,,,,,,,,,,,,,,,,,,,0.0,,did not exist,,,,,,,,,,,,,
6087592725708800,2021-07-16,Female,25-34,Suburban/Peri-urban,"I can afford food and regular expenses, but nothing else",University or college degree completed,"I work part-time, either as an employee or self-employed",Miranda,0,,,,,,,,,,,,,,,,,,,0.0,,,,,,,,,,,,,,,
6508509194878976,2020-09-16,Female,35-44,Suburban/Peri-urban,"I can afford food and regular expenses, but nothing else",University or college degree completed,"I work part-time, either as an employee or self-employed",Miranda,0,,,,,,,,,,,,,,,,,,,1.0,"Mental health conditions (anxiety, depression)",,0.0,,,,,,,I don't have the money to buy it,,,,,
6691337828302848,2020-10-29,Female,25-34,City center or metropolitan area,"I can afford food and regular expenses, but nothing else",Technical school diploma or degree completed,"I work part-time, either as an employee or self-employed",Bolívar,0,,,,,,,,,,,,,,,,,,,1.0,"Heart disease (Hypertension)^Mental health conditions (anxiety, depression)",,0.0,,,,,,,I can't find it,,,,,
5187146623483904,2020-06-19,Female,35-44,Rural,Prefer not to answer,Technical school diploma or degree completed,I am unemployed,Miranda,0,,,,,,,,,,,,,,,,,,,0.0,,did not exist,,,,,,,,,,,,,
5579983868395520,2020-10-17,Female,35-44,Rural,Prefer not to answer,Technical school diploma or degree completed,I am unemployed,Miranda,0,,,,,,,,,,,,,,,,,,,0.0,,,,,,,,,,,,,,,
6488218494304256,2020-09-16,Female,45-54,Rural,Prefer not to answer,Technical school diploma or degree completed,I am unemployed,Miranda,0,,,,,,,,,,,,,,,,,,,0.0,,,,,,,,,,,,,,,
5253750227992576,2020-07-16,Female,35-44,Rural,Prefer not to answer,Technical school diploma or degree completed,I am unemployed,Miranda,0,,,,,,,,,,,,,,,,,,,0.0,,did not exist,,,,,,,,,,,,,
4680709435555840,2021-02-16,Female,45-54,Rural,Prefer not to answer,Technical school diploma or degree completed,I am unemployed,Miranda,1,Hospital,,Medical consult,,1.0,,,Myself,,1.0,,I bought it,,,2.0,,Walking on foot,,0.0,,,,,,,,,,,,,,,
4678918771834880,2020-11-17,Female,35-44,Rural,Prefer not to answer,Technical school diploma or degree completed,I am unemployed,Miranda,0,,,,,,,,,,,,,,,,,,,0.0,,,,,,,,,,,,,,,
4735290920140800,2021-01-24,Male,25-34,Suburban/Peri-urban,"I can afford food, regular expenses, and clothes, but nothing else",Some university or college,"I work full-time, either as an employee or self-employed",Lara,1,Ambulatory clinic,,Routine medical check-up,,0.0,Lack of staff,,,,,,,,,,,,,0.0,,,,,,,,,,,,,,,
6531423705235456,2021-01-18,Male,25-34,Suburban/Peri-urban,"I can afford food, regular expenses, and clothes, but nothing else",Some university or college,"I work full-time, either as an employee or self-employed",Lara,0,,,,,,,,,,,,,,,,,,,0.0,,,,,,,,,,,,,,,
6240595667582976,2021-08-23,Male,18-24,Suburban/Peri-urban,"I can afford food, regular expenses, and clothes, but nothing else",Some university or college,"I work full-time, either as an employee or self-employed",Lara,0,,,,,,,,,,,,,,,,,,,1.0,Heart disease (Hypertension),,0.0,,,,,,,I can't find it,,,,,
5305480602976256,2021-03-23,Male,25-34,Suburban/Peri-urban,"I can afford food, regular expenses, and clothes, but nothing else",Some university or college,"I work full-time, either as an employee or self-employed",Lara,0,,,,,,,,,,,,,,,,,,,0.0,,,,,,,,,,,,,,,
6022259474169856,2021-03-01,Male,25-34,Suburban/Peri-urban,"I can afford food, regular expenses, and clothes, but nothing else",Some university or college,"I work full-time, either as an employee or self-employed",Lara,1,Ambulatory clinic,,Medical consult,,1.0,,,Myself,,1.0,,I bought it,,,1.0,,My own vehicle,,0.0,,,,,,,,,,,,,,,
4618402271592448,2020-12-16,Female,18-24,Rural,"I can afford food, but nothing else",Secondary school/ high school completed,I am a student,Distrito Federal,0,,,,,,,,,,,,,,,,,,,0.0,,,,,,,,,,,,,,,
6329371658027008,2020-11-16,Female,18-24,Rural,"I can afford food, but nothing else",Secondary school/ high school completed,I am a student,Distrito Federal,0,,,,,,,,,,,,,,,,,,,0.0,,,,,,,,,,,,,,,
5270016711983104,2020-07-18,Male,45-54,Suburban/Peri-urban,"I can afford food, regular expenses, and clothes, but nothing else",University or college degree completed,"I work part-time, either as an employee or self-employed",Miranda,1,Private office,,Medical consult,,1.0,,,Myself,,1.0,,I bought it,,,3.0,,Walking on foot,,0.0,,did not exist,,,,,,,,,,,,,
4847063260200960,2021-01-17,Male,18-24,Suburban/Peri-urban,Prefer not to answer,Secondary school/ high school completed,I am a student,Zulia,1,Diagnostic clinic,,Medical consult,,1.0,,,Myself,,0.0,1.0,A friend or relative bought it,,,2.0,,Walking on foot,,0.0,,,,,,,,,,,,,,,
6178640682549248,2020-08-09,Male,18-24,Suburban/Peri-urban,Prefer not to answer,Secondary school/ high school completed,I am a student,Zulia,0,,,,,,,,,,,,,,,,,,,0.0,,did not exist,,,,,,,,,,,,,
6346475849383936,2020-09-19,Male,18-24,Suburban/Peri-urban,Prefer not to answer,Secondary school/ high school completed,I am a student,Zulia,0,,,,,,,,,,,,,,,,,,,0.0,,,,,,,,,,,,,,,
6113624293900288,2020-10-18,Male,18-24,Suburban/Peri-urban,Prefer not to answer,Secondary school/ high school completed,I am a student,Zulia,0,,,,,,,,,,,,,,,,,,,0.0,,,,,,,,,,,,,,,
5638282745741312,2021-01-16,Male,45-54,Suburban/Peri-urban,"I can afford food and regular expenses, but nothing else",University or college degree completed,"I work part-time, either as an employee or self-employed",Miranda,0,,,,,,,,,,,,,,,,,,,0.0,,,,,,,,,,,,,,,
6662121929834496,2020-08-17,Male,45-54,Suburban/Peri-urban,"I can afford food and regular expenses, but nothing else",University or college degree completed,"I work part-time, either as an employee or self-employed",Miranda,0,,,,,,,,,,,,,,,,,,,0.0,,did not exist,,,,,,,,,,,,,
5268782076133376,2021-09-16,Male,55 or more,Suburban/Peri-urban,"I can afford food and regular expenses, but nothing else",University or college degree completed,"I work part-time, either as an employee or self-employed",Miranda,1,Hospital,,Medical consult,,1.0,,,Myself,,0.0,1.0,I bought it,,,5.0,,Public transport,,0.0,,,,,,,,,,,,,,,
5547916751273984,2021-02-16,Male,45-54,Suburban/Peri-urban,"I can afford food and regular expenses, but nothing else",University or college degree completed,"I work part-time, either as an employee or self-employed",Guárico,0,,,,,,,,,,,,,,,,,,,0.0,,,,,,,,,,,,,,,
6439216184819712,2020-11-16,Male,45-54,Suburban/Peri-urban,"I can afford food and regular expenses, but nothing else",University or college degree completed,"I work part-time, either as an employee or self-employed",Miranda,0,,,,,,,,,,,,,,,,,,,0.0,,,,,,,,,,,,,,,
5443882222616576,2020-07-16,Male,35-44,Suburban/Peri-urban,"I can afford food and regular expenses, but nothing else",College or university,Employed full-time,Táchira,0,,,,,,,,,,,,,,,,,,,0.0,,did not exist,,,,,,,,,,,,,
6204413120348160,2020-06-28,Male,35-44,Suburban/Peri-urban,"I can afford food and regular expenses, but nothing else",College or university,Employed full-time,Táchira,0,,,,,,,,,,,,,,,,,,,0.0,,did not exist,,,,,,,,,,,,,
6000365184221184,2020-11-17,Female,25-34,Rural,"I can afford food, but nothing else",Technical school diploma or degree completed,"I work full-time, either as an employee or self-employed",Táchira,0,,,,,,,,,,,,,,,,,,,0.0,,,,,,,,,,,,,,,
4838776225660928,2020-07-19,Female,25-34,Rural,"I can afford food, but nothing else",Technical school diploma or degree completed,"I work full-time, either as an employee or self-employed",Táchira,0,,,,,,,,,,,,,,,,,,,0.0,,did not exist,,,,,,,,,,,,,
5454019287056384,2021-01-16,Female,25-34,Rural,"I can afford food, but nothing else",Technical school diploma or degree completed,"I work full-time, either as an employee or self-employed",Táchira,0,,,,,,,,,,,,,,,,,,,0.0,,,,,,,,,,,,,,,
4813198265155584,2020-12-17,Female,25-34,Rural,"I can afford food, but nothing else",Technical school diploma or degree completed,"I work full-time, either as an employee or self-employed",Táchira,0,,,,,,,,,,,,,,,,,,,0.0,,,,,,,,,,,,,,,
4678592115245056,2020-08-20,Female,25-34,Rural,"I can afford food, but nothing else",Technical school diploma or degree completed,"I work full-time, either as an employee or self-employed",Táchira,0,,,,,,,,,,,,,,,,,,,0.0,,did not exist,,,,,,,,,,,,,
5054580921729024,2020-10-18,Female,18-24,Rural,"I can afford food, but nothing else",Technical school diploma or degree completed,"I work full-time, either as an employee or self-employed",Táchira,0,,,,,,,,,,,,,,,,,,,0.0,,,,,,,,,,,,,,,
6357541552652288,2020-06-18,Female,25-34,Rural,"I can afford food, but nothing else",Technical school diploma or degree completed,"I work full-time, either as an employee or self-employed",Táchira,0,,,,,,,,,,,,,,,,,,,0.0,,did not exist,,,,,,,,,,,,,
5768534094512128,2020-09-16,Female,25-34,Rural,"I can afford food, but nothing else",Technical school diploma or degree completed,"I work full-time, either as an employee or self-employed",Táchira,0,,,,,,,,,,,,,,,,,,,0.0,,,,,,,,,,,,,,,
4935090416386048,2021-02-17,Female,25-34,Rural,"I can afford food, but nothing else",Technical school diploma or degree completed,"I work full-time, either as an employee or self-employed",Táchira,0,,,,,,,,,,,,,,,,,,,0.0,,,,,,,,,,,,,,,
5499717730697216,2021-03-16,Female,25-34,Rural,"I can afford food, but nothing else",Technical school diploma or degree completed,"I work full-time, either as an employee or self-employed",Táchira,0,,,,,,,,,,,,,,,,,,,0.0,,,,,,,,,,,,,,,
6688827895971840,2021-03-16,Male,35-44,Suburban/Peri-urban,I cannot afford enough food for my family,Technical school diploma or degree completed,"I work full-time, either as an employee or self-employed",Táchira,1,Ambulatory clinic,,Medical consult,,1.0,,,Myself,,1.0,,I bought it,,,5.0,,Walking on foot,,0.0,,,,,,,,,,,,,,,
5767399900184576,2020-10-29,Male,25-34,Suburban/Peri-urban,I cannot afford enough food for my family,Technical school diploma or degree completed,"I work full-time, either as an employee or self-employed",Táchira,0,,,,,,,,,,,,,,,,,,,0.0,,,,,,,,,,,,,,,
5436688991256576,2020-07-16,Female,25-34,Rural,"I can afford food, but nothing else",University or college degree completed,"I work full-time, either as an employee or self-employed",Miranda,0,,,,,,,,,,,,,,,,,,,0.0,,did not exist,,,,,,,,,,,,,
6064242395709440,2020-12-16,Female,25-34,Rural,"I can afford food, but nothing else",University or college degree completed,"I work full-time, either as an employee or self-employed",Distrito Federal,0,,,,,,,,,,,,,,,,,,,0.0,,,,,,,,,,,,,,,
5837485025525760,2020-11-17,Female,25-34,Rural,"I can afford food, but nothing else",University or college degree completed,"I work full-time, either as an employee or self-employed",Distrito Federal,0,,,,,,,,,,,,,,,,,,,0.0,,,,,,,,,,,,,,,
4930655572197376,2020-06-17,Female,25-34,Rural,"I can afford food, but nothing else",University or college degree completed,"I work full-time, either as an employee or self-employed",Miranda,0,,,,,,,,,,,,,,,,,,,0.0,,did not exist,,,,,,,,,,,,,
6291322031046656,2020-12-16,Female,25-34,Rural,"I can afford food, but nothing else",University or college degree completed,"I work full-time, either as an employee or self-employed",Miranda,0,,,,,,,,,,,,,,,,,,,0.0,,,,,,,,,,,,,,,
5403993728876544,2020-09-17,Female,25-34,Rural,"I can afford food, but nothing else",University or college degree completed,"I work full-time, either as an employee or self-employed",Miranda,0,,,,,,,,,,,,,,,,,,,0.0,,,,,,,,,,,,,,,
4589449368567808,2020-11-16,Female,25-34,Rural,"I can afford food, but nothing else",University or college degree completed,"I work full-time, either as an employee or self-employed",Miranda,0,,,,,,,,,,,,,,,,,,,0.0,,,,,,,,,,,,,,,
4970775619829760,2020-08-17,Female,25-34,Rural,"I can afford food, but nothing else",University or college degree completed,"I work full-time, either as an employee or self-employed",Distrito Federal,0,,,,,,,,,,,,,,,,,,,0.0,,did not exist,,,,,,,,,,,,,
6704030593318912,2020-07-17,Female,25-34,Rural,"I can afford food, but nothing else",University or college degree completed,"I work full-time, either as an employee or self-employed",Distrito Federal,0,,,,,,,,,,,,,,,,,,,0.0,,did not exist,,,,,,,,,,,,,
6398522588135424,2021-07-16,Female,25-34,Rural,"I can afford food, but nothing else",University or college degree completed,"I work full-time, either as an employee or self-employed",Miranda,0,,,,,,,,,,,,,,,,,,,0.0,,,,,,,,,,,,,,,
4604671871418368,2021-02-16,Female,25-34,Rural,"I can afford food, but nothing else",University or college degree completed,"I work full-time, either as an employee or self-employed",Miranda,0,,,,,,,,,,,,,,,,,,,0.0,,,,,,,,,,,,,,,
4736856295211008,2020-12-16,Female,55 or more,Suburban/Peri-urban,"I can afford food and regular expenses, but nothing else",Secondary school/ high school completed,I am a student,Miranda,1,Ambulatory clinic,,Medical consult,,1.0,,,Myself,,0.0,1.0,I bought it,,,2.0,,Walking on foot,,0.0,,,,,,,,,,,,,,,
4593977484640256,2020-07-16,Female,55 or more,Suburban/Peri-urban,"I can afford food and regular expenses, but nothing else",Secondary school/ high school completed,I am a student,Miranda,0,,,,,,,,,,,,,,,,,,,0.0,,did not exist,,,,,,,,,,,,,
6458844382494720,2020-08-16,Female,25-34,Rural,I cannot afford enough food for my family,University or college degree completed,I am a student and I work part-time,Miranda,0,,,,,,,,,,,,,,,,,,,0.0,,did not exist,,,,,,,,,,,,,
5911695649406976,2021-02-16,Female,25-34,Rural,I cannot afford enough food for my family,University or college degree completed,I am a student and I work part-time,Miranda,0,,,,,,,,,,,,,,,,,,,0.0,,,,,,,,,,,,,,,
4859383499718656,2020-11-16,Female,25-34,Rural,I cannot afford enough food for my family,University or college degree completed,I am a student and I work part-time,Miranda,0,,,,,,,,,,,,,,,,,,,0.0,,,,,,,,,,,,,,,